Register

Welcome to the RDI-Board Community.

If this is your first visit, be sure to check out the FAQ by clicking the link above. You may have to register before you can post: click the register link above to proceed.


Donate Now Goal amount for this month: 100 EUR, Received: 100 EUR (100%)
Donate to support this site...

Results 1 to 9 of 9
  1. #1
    Moderator Expert
    Join Date
    Sep 2003
    Location
    BRASOV
    Posts
    3,460
    Posts Thanks / Likes

    Default compilare oscam esuata..

    am observat ca ultimele versiuni de oscam imi da eroare la compilare

    `libusb_control_transfer'
    ifd_smartreader.c.text+0x17f4): undefined reference to `libusb_control_transfer'
    csctapi/libcsctapi.a(ifd_smartreader.o): In function `EnableSmartReader':
    ifd_smartreader.c.text+0x18d4): undefined reference to `libusb_control_transfer'
    ifd_smartreader.c.text+0x1924): undefined reference to `libusb_control_transfer'
    ifd_smartreader.c.text+0x1b29): undefined reference to `libusb_control_transfer'
    csctapi/libcsctapi.a(ifd_smartreader.o):ifd_smartreader.c.text+0x1b9f): more undefined references to `libusb_control_transfer' follow
    collect2: ld returned 1 exit status
    make[2]: *** [oscam] Error 1
    make[1]: *** [CMakeFiles/oscam.dir/all] Error 2
    make: *** [all] Error 2
    [email protected]:~/oscam-svn/build_dir#
    350 kg de scule!

  2. #2
    Moderator Expert
    Join Date
    Apr 2003
    Location
    Wild West
    Posts
    2,527
    Posts Thanks / Likes

    Default


  3. #3
    Non Member Teacher
    RDI - Board Default Avatar

    Join Date
    Aug 2008
    Location
    Cluj-Napoca
    Posts
    185
    Posts Thanks / Likes

    Default

    Am compilat ultima versiune oscam 3076 si nu au aparut erori.
    Eu procedez asa:

    1. cd
    2. apt-get install openssl libssl-dev gcc g++ pcscd pcsc-tools libpcsclite1 libpcsclite-dev cmake make libpthread-stubs0 libpthread-stubs0-dev libncurses5 libncurses5-dev wget bzip2
    3. wget http://cdnetworks-us-2.dl.sourceforg...-1.0.8.tar.bz2
    4. tar xjvf libusb-1.0.8.tar.bz2
    5. cd libusb-1.0.8
    6. ./configure
    7. make
    8. sudo make install

    9. cd
    10. svn co http://streamboard.gmc.to/svn/oscam/trunk oscam-svn
    11. cd oscam-svn
    12. mkdir build
    13. cd build
    14. cmake -DWEBIF=1 ..
    15. make
    16. sudo cp -f oscam /usr/local/bin
    17. sudo cp -f utils/list_smargo /usr/local/bin
    Last edited by crf23; 17th September 2010 at 01:40.

  4. #4
    Member Mentor
    Join Date
    Mar 2007
    Location
    Gammapolis
    Posts
    588
    Posts Thanks / Likes

    Default

    Va recomand sa folositi Easy Build Script. Maine uploadez (il am scriptul pe calculatorul cu Ubuntu)

    E foarte usor de folosit.

    [DIGI-S/C Extra Complet] [0.8m Fe, LNB 0.2dB 1W+19.2E, DM500S] [0.9m Al, LNB 0.2dB Quad 1W, HSS-1160NA] [1.5m Al Motorized (15W-53E), LNB 0.2dB, Sunray4 SR4 TripleTuner] [Humax DIGI+C][15W-68.5E]

  5. #5
    Member Mentor
    Join Date
    Mar 2007
    Location
    Gammapolis
    Posts
    588
    Posts Thanks / Likes

    [DIGI-S/C Extra Complet] [0.8m Fe, LNB 0.2dB 1W+19.2E, DM500S] [0.9m Al, LNB 0.2dB Quad 1W, HSS-1160NA] [1.5m Al Motorized (15W-53E), LNB 0.2dB, Sunray4 SR4 TripleTuner] [Humax DIGI+C][15W-68.5E]

  6. #6
    Târnacopist Expert
    Join Date
    Dec 2005
    Location
    /home/satwien/
    Posts
    6,001
    Posts Thanks / Likes

    Default

    Quote Originally Posted by gogi View Post
    am observat ca ultimele versiuni de oscam imi da eroare la compilare

    `libusb_control_transfer'
    ifd_smartreader.c.text+0x17f4): undefined reference to `libusb_control_transfer'
    csctapi/libcsctapi.a(ifd_smartreader.o): In function `EnableSmartReader':
    ifd_smartreader.c.text+0x18d4): undefined reference to `libusb_control_transfer'
    ifd_smartreader.c.text+0x1924): undefined reference to `libusb_control_transfer'
    ifd_smartreader.c.text+0x1b29): undefined reference to `libusb_control_transfer'
    csctapi/libcsctapi.a(ifd_smartreader.o):ifd_smartreader.c.text+0x1b9f): more undefined references to `libusb_control_transfer' follow
    collect2: ld returned 1 exit status
    make[2]: *** [oscam] Error 1
    make[1]: *** [CMakeFiles/oscam.dir/all] Error 2
    make: *** [all] Error 2
    [email protected]:~/oscam-svn/build_dir#
    Pe ce kernel faci compilarea?

  7. #7
    Moderator Expert
    Join Date
    Sep 2003
    Location
    BRASOV
    Posts
    3,460
    Posts Thanks / Likes

    Default

    debian,server dedicat HP,kernel 2.6.26-2-686!
    versiunile mai vechi de oscam nu au facut probleme!
    le gasesc oricum gata compilate ptru debian pe streamboard,dar parca e mai fain cand le faci singur
    350 kg de scule!

  8. #8
    Non Member Teacher
    RDI - Board Default Avatar

    Join Date
    Aug 2008
    Location
    Cluj-Napoca
    Posts
    185
    Posts Thanks / Likes

    Default

    Eu iti propun sa faci un update la kernel. Versiunile mai vechi de 2.6.30 au buguri pe partea de usb.

  9. #9
    Moderator Expert
    Join Date
    Sep 2003
    Location
    BRASOV
    Posts
    3,460
    Posts Thanks / Likes

    Default

    man,nu e asa simplu...
    odata m-am fript cu compilarea kernelului si de atunci astept numai ver oficiale
    350 kg de scule!

 

 

Thread Information

Users Browsing this Thread

There are currently 1 users browsing this thread. (0 members and 1 guests)

Posting Permissions

  • You may not post new threads
  • You may not post replies
  • You may not post attachments
  • You may not edit your posts
  •  
Back to Top